{"text_format":"1","workbook":"xlsx","n_sheets":10,"sheets":["PTD Worksheet","Age 90 Calc","Life Exp","saww info","Password","Pension Dates","First Process Date","Retirement Date","LSA at 25%","PTD%PP Offset"],"not_rendered":{"charts":0,"images":3,"macros":1,"external_links":1,"defined_names":41,"comments":0,"pivot_tables":0},"unopened":[],"bounds":{"document_bytes":16777216,"sheet_cells":100000,"rows_first":2000,"rows_last":500,"rows_between":2000,"halvings":0,"cell_chars":16384,"cell_head_chars":4096},"cells_cut":0,"cells_raw":0,"read":"whole","date_system":"1900"}

{"sheet":"PTD Worksheet","index":0,"n_rows":56,"n_cols":11,"rows_kept":56,"cut":false,"hidden":false,"merged":[[55,2,55,5],[0,6,0,7],[0,1,0,3],[2,0,2,8],[25,0,25,8]]}
["Claim #:",null,null,null,null,"IW Name:",null,null,"Date of Occurrence:",null,{"$f":"J1","v":"00:00:00"}]
[]
["1.  Calculating the weekly workers' compensation amount pursuant to Ohio Revised Code 4123.58 (A).  4 Variables required:"]
[]
[null,null,null,"AWW"]
[null,{"$f":"INDEX('saww info'!C:C,MATCH($K$1,'saww info'!F:F,0))","v":{"$error":"#N/A"}},null,"50% SAWW (minimum PTD from Rate Chart for DOI)"]
[null,{"$f":"(B5*2)/3","v":0},null,"2/3 AWW"]
[null,{"$f":"INDEX('saww info'!D:D,MATCH($K$1,'saww info'!F:F,0))","v":{"$error":"#N/A"}},null,"2/3 SAWW (\"PTD offset\" amount from Rate Chart for DOI)"]
[]
[null,{"$f":"IF(B7>=B8,\"Yes\",\" No\")","v":{"$error":"#N/A"}},"a)","If 2/3 of AWW ",null,{"$f":"B7","v":0},"> 2/3 SAWW",{"$f":"B8","v":{"$error":"#N/A"}},"then WWAC ="]
[null,null,null,"2/3 of SAWW",null,{"$f":"B8","v":{"$error":"#N/A"}}]
[]
[null,{"$f":"IF(AWW<B6,\"Yes\",\"No\")","v":{"$error":"#N/A"}},"b)","If AWW",null,{"$f":"AWW","v":0},"< 50% SAWW",{"$f":"B6","v":{"$error":"#N/A"}},"then WWAC ="]
[null,null,null,"AWW",null,{"$f":"AWW","v":0}]
[]
[null,{"$f":"IF(AND(AWW>=B6, B7<B6),\"Yes\",\"No\")","v":{"$error":"#N/A"}},"c)","If AWW",null,{"$f":"B5","v":0},"> 50%SAWW",{"$f":"B6","v":{"$error":"#N/A"}},","]
[null,null,null,"but 2/3 AWW",null,{"$f":"B7","v":0},"< 50% SAWW",{"$f":"B6","v":{"$error":"#N/A"}},"then WWAC ="]
[null,null,null,"50% SAWW",null,{"$f":"B6","v":{"$error":"#N/A"}}]
[]
[null,{"$f":"IF(AND(B7>B6, B7<B8),\"Yes\",\"No\")","v":{"$error":"#N/A"}},"d)","If 2/3 of AWW",null,{"$f":"B7","v":0},">50% of SAWW",{"$f":"B6","v":{"$error":"#N/A"}},","]
{"$rows_left_out":37}
{"sheet":"Age 90 Calc","index":1,"n_rows":7,"n_cols":13,"rows_kept":7,"cut":false,"hidden":false,"merged":[[4,6,5,8],[4,4,4,5],[5,4,5,5],[4,1,5,2],[4,3,5,3]]}
[]
[null,null,null,null,null,null,null,null,null,null,null,null,"NON-OD"]
[null,null,null,null,null,null,null,null,null,null,null,null,"OD-LUNG"]
[null,null,null,null,null,null,null,null,null,null,null,null,"OD-NON LUNG"]
[null,"Claimant DOB",null,null,"PTD/DWRF Plan Ending Date",null,{"$f":"IF(B7=11,F7+92,IF(B7=12,F7+62,IF(B7=1,F7+31,F7)))","v":{"$error":"#VALUE!"}},{"$f":"IF(#REF!=11,#REF!+92,IF(#REF!=12,#REF!+62,IF(#REF!=1,#REF!+31,#REF!)))","v":{"$error":"#REF!"}},{"$f":"IF(#REF!=11,#REF!+92,IF(#REF!=12,#REF!+62,IF(#REF!=1,#REF!+31,#REF!)))","v":{"$error":"#REF!"}}]
[null,null,null,null,"(to age 90 adjusted for year end)",null,{"$f":"IF(B5=11,F5+92,IF(B5=12,F5+62,IF(B5=1,F5+31,F5)))","v":"00:00:00"},{"$f":"IF(D5=11,G5+92,IF(D5=12,G5+62,IF(D5=1,G5+31,G5)))","v":{"$error":"#VALUE!"}},{"$f":"IF(E5=11,H5+92,IF(E5=12,H5+62,IF(E5=1,H5+31,H5)))","v":{"$error":"#REF!"}}]
[null,{"$f":"MONTH(D5)","v":1},{"$f":"DAY(D5)","v":0},{"$f":"YEAR(D5)","v":1900},{"$f":"D7+90","v":1990},{"$f":"CONCATENATE(B7,\"/\",C7,\"/\",E7)","v":"1/0/1990"}]

{"sheet":"Life Exp","index":2,"n_rows":90,"n_cols":9,"rows_kept":90,"cut":false,"hidden":true,"merged":[[0,11,3,11],[45,11,46,11],[65,10,67,11],[69,10,69,11]]}
[null,"SURVIVOR (1)",null,"PTD-NON-OD(2)",null,"PTD-OD LUNG (3)",null,"PTD-OD-NON LUNG(4)"]
["AGE","FACTOR","LIFE EXPECT-ANCY IN YEARS","FACTOR","LIFE EXPECT-ANCY IN YEARS","FACTOR","LIFE EXPECT-ANCY IN YEARS","FACTOR","LIFE EXPECT-ANCY IN YEARS"]
[17,1022,50.9,1144,55.8,1110,51.3,1138,55.1]
[18,1043,51.8,1138,54.9,1103,50.4,1132,54.1]
[19,1059,52.4,1132,53.9,1096,49.5,1126,53.2]
[20,1069,52.7,1125,53,1089,48.6,1119,52.3]
[21,1077,52.7,1119,52.1,1082,47.7,1113,51.3]
[22,1082,52.6,1112,51.1,1074,46.8,1106,50.4]
[23,1085,52.4,1105,50.2,1066,45.8,1099,49.5]
[24,1087,52,1098,49.3,1058,44.9,1091,48.5]
[25,1086,51.6,1090,48.3,1049,44,1084,47.6]
[26,1085,51.1,1082,47.4,1041,43.1,1076,46.7]
[27,1083,50.5,1074,46.5,1032,42.2,1068,45.8]
[28,1081,49.9,1066,45.6,1023,41.3,1059,44.8]
[29,1077,49.3,1058,44.6,1013,40.4,1050,43.9]
[30,1073,48.7,1049,43.7,1003,39.5,1041,43]
[31,1069,48,1039,42.8,993,38.6,1032,42.1]
[32,1064,47.3,1030,41.9,982,37.700000000000003,1022,41.2]
[33,1059,46.6,1020,40.9,971,36.799999999999997,1012,40.200000000000003]
[34,1054,45.9,1009,40,959,35.9,1001,39.299999999999997]
{"$rows_left_out":71}
{"sheet":"saww info","index":3,"n_rows":58,"n_cols":6,"rows_kept":58,"cut":false,"hidden":true,"merged":[]}
["Begin Date","End Date","PTD Min","PTD Max","SAWW"]
["1959-11-02","1963-09-30",40.25,49,49,{"$f":"IF(AND('PTD Worksheet'!$J$1>=A2,'PTD Worksheet'!$J$1<=B2),'PTD Worksheet'!$J$1,FALSE)","v":false}]
["1963-10-01","1967-12-10",40.25,49,49,{"$f":"IF(AND('PTD Worksheet'!$J$1>=A3,'PTD Worksheet'!$J$1<=B3),'PTD Worksheet'!$J$1,FALSE)","v":false}]
["1967-12-11","1971-09-19",45.5,56,56,{"$f":"IF(AND('PTD Worksheet'!$J$1>=A4,'PTD Worksheet'!$J$1<=B4),'PTD Worksheet'!$J$1,FALSE)","v":false}]
["1971-09-20","1972-12-31",49,77,77,{"$f":"IF(AND('PTD Worksheet'!$J$1>=A5,'PTD Worksheet'!$J$1<=B5),'PTD Worksheet'!$J$1,FALSE)","v":false}]
[{"$f":"B5+1","v":"1973-01-01"},"1973-11-15",49,79.31,79.31,{"$f":"IF(AND('PTD Worksheet'!$J$1>=A6,'PTD Worksheet'!$J$1<=B6),'PTD Worksheet'!$J$1,FALSE)","v":false}]
[{"$f":"B6+1","v":"1973-11-16"},"1973-12-31",80,106.67,106.67,{"$f":"IF(AND('PTD Worksheet'!$J$1>=A7,'PTD Worksheet'!$J$1<=B7),'PTD Worksheet'!$J$1,FALSE)","v":false}]
["1974-01-01","1974-12-31",84,112,112,{"$f":"IF(AND('PTD Worksheet'!$J$1>=A8,'PTD Worksheet'!$J$1<=B8),'PTD Worksheet'!$J$1,FALSE)","v":false}]
["1975-01-01","1975-12-31",89.25,119,119,{"$f":"IF(AND('PTD Worksheet'!$J$1>=A9,'PTD Worksheet'!$J$1<=B9),'PTD Worksheet'!$J$1,FALSE)","v":false}]
["1976-01-01","1976-12-31",93,124,{"$f":"C10*2","v":186},{"$f":"IF(AND('PTD Worksheet'!$J$1>=A10,'PTD Worksheet'!$J$1<=B10),'PTD Worksheet'!$J$1,FALSE)","v":false}]
["1977-01-01","1977-12-31",99,{"$f":"E11*2/3","v":132},198,{"$f":"IF(AND('PTD Worksheet'!$J$1>=A11,'PTD Worksheet'!$J$1<=B11),'PTD Worksheet'!$J$1,FALSE)","v":false}]
["1978-01-01",{"$f":"B11+365","v":"1978-12-31"},108,{"$f":"E12*2/3","v":144},216,{"$f":"IF(AND('PTD Worksheet'!$J$1>=A12,'PTD Worksheet'!$J$1<=B12),'PTD Worksheet'!$J$1,FALSE)","v":false}]
["1979-01-01",{"$f":"B12+365","v":"1979-12-31"},120.5,160.66666666666666,241,{"$f":"IF(AND('PTD Worksheet'!$J$1>=A13,'PTD Worksheet'!$J$1<=B13),'PTD Worksheet'!$J$1,FALSE)","v":false}]
["1980-01-01","1980-12-31",129,172,258,{"$f":"IF(AND('PTD Worksheet'!$J$1>=A14,'PTD Worksheet'!$J$1<=B14),'PTD Worksheet'!$J$1,FALSE)","v":false}]
["1981-01-01","1981-12-31",137.5,183.33333333333334,275,{"$f":"IF(AND('PTD Worksheet'!$J$1>=A15,'PTD Worksheet'!$J$1<=B15),'PTD Worksheet'!$J$1,FALSE)","v":false}]
["1982-01-01","1982-12-31",149,198.66666666666666,298,{"$f":"IF(AND('PTD Worksheet'!$J$1>=A16,'PTD Worksheet'!$J$1<=B16),'PTD Worksheet'!$J$1,FALSE)","v":false}]
["1983-01-01","1983-12-31",160.5,214,321,{"$f":"IF(AND('PTD Worksheet'!$J$1>=A17,'PTD Worksheet'!$J$1<=B17),'PTD Worksheet'!$J$1,FALSE)","v":false}]
["1984-01-01","1984-12-31",167.5,223.33333333333334,335,{"$f":"IF(AND('PTD Worksheet'!$J$1>=A18,'PTD Worksheet'!$J$1<=B18),'PTD Worksheet'!$J$1,FALSE)","v":false}]
["1985-01-01","1985-12-31",177,236,354,{"$f":"IF(AND('PTD Worksheet'!$J$1>=A19,'PTD Worksheet'!$J$1<=B19),'PTD Worksheet'!$J$1,FALSE)","v":false}]
["1986-01-01","1986-12-31",182.5,243.33333333333334,365,{"$f":"IF(AND('PTD Worksheet'!$J$1>=A20,'PTD Worksheet'!$J$1<=B20),'PTD Worksheet'!$J$1,FALSE)","v":false}]
{"$rows_left_out":39}
{"sheet":"Password","index":4,"n_rows":6,"n_cols":1,"rows_kept":6,"cut":false,"hidden":true,"merged":[]}
["ptdrate"]
["life"]
["process"]
["retire"]
["lsa25"]
["ppptd"]

{"sheet":"Pension Dates","index":5,"n_rows":688,"n_cols":5,"rows_kept":688,"cut":false,"hidden":true,"merged":[]}
["Pension Period Begin Date","Pension Period End Date","First Row Process Date as shown in PowerSuite","Match","Match"]
["2014-09-07","2014-09-20","2014-09-06",{"$f":"IF(AND('First Process Date'!$F$2>='Pension Dates'!A2,'First Process Date'!$F$2<='Pension Dates'!B2),'First Process Date'!$C$2,FALSE)","v":false},{"$f":"IF(AND('First Process Date'!$F$8>='Pension Dates'!A2,'First Process Date'!$F$8<='Pension Dates'!B2),'First Process Date'!$C$8,FALSE)","v":false}]
["2014-09-21","2014-10-04","2014-09-20",{"$f":"IF(AND('First Process Date'!$F$2>='Pension Dates'!A3,'First Process Date'!$F$2<='Pension Dates'!B3),'First Process Date'!$C$2,FALSE)","v":false},{"$f":"IF(AND('First Process Date'!$F$8>='Pension Dates'!A3,'First Process Date'!$F$8<='Pension Dates'!B3),'First Process Date'!$C$8,FALSE)","v":false}]
["2014-10-05","2014-10-18","2014-10-04",{"$f":"IF(AND('First Process Date'!$F$2>='Pension Dates'!A4,'First Process Date'!$F$2<='Pension Dates'!B4),'First Process Date'!$C$2,FALSE)","v":false},{"$f":"IF(AND('First Process Date'!$F$8>='Pension Dates'!A4,'First Process Date'!$F$8<='Pension Dates'!B4),'First Process Date'!$C$8,FALSE)","v":false}]
["2014-10-19","2014-11-01","2014-10-18",{"$f":"IF(AND('First Process Date'!$F$2>='Pension Dates'!A5,'First Process Date'!$F$2<='Pension Dates'!B5),'First Process Date'!$C$2,FALSE)","v":false},{"$f":"IF(AND('First Process Date'!$F$8>='Pension Dates'!A5,'First Process Date'!$F$8<='Pension Dates'!B5),'First Process Date'!$C$8,FALSE)","v":false}]
["2014-11-02","2014-11-15","2014-11-01",{"$f":"IF(AND('First Process Date'!$F$2>='Pension Dates'!A6,'First Process Date'!$F$2<='Pension Dates'!B6),'First Process Date'!$C$2,FALSE)","v":false},{"$f":"IF(AND('First Process Date'!$F$8>='Pension Dates'!A6,'First Process Date'!$F$8<='Pension Dates'!B6),'First Process Date'!$C$8,FALSE)","v":false}]
["2014-11-16","2014-11-29","2014-11-15",{"$f":"IF(AND('First Process Date'!$F$2>='Pension Dates'!A7,'First Process Date'!$F$2<='Pension Dates'!B7),'First Process Date'!$C$2,FALSE)","v":false},{"$f":"IF(AND('First Process Date'!$F$8>='Pension Dates'!A7,'First Process Date'!$F$8<='Pension Dates'!B7),'First Process Date'!$C$8,FALSE)","v":false}]
["2014-11-30","2014-12-13","2014-11-29",{"$f":"IF(AND('First Process Date'!$F$2>='Pension Dates'!A8,'First Process Date'!$F$2<='Pension Dates'!B8),'First Process Date'!$C$2,FALSE)","v":false},{"$f":"IF(AND('First Process Date'!$F$8>='Pension Dates'!A8,'First Process Date'!$F$8<='Pension Dates'!B8),'First Process Date'!$C$8,FALSE)","v":false}]
["2014-12-14","2014-12-27","2014-12-13",{"$f":"IF(AND('First Process Date'!$F$2>='Pension Dates'!A9,'First Process Date'!$F$2<='Pension Dates'!B9),'First Process Date'!$C$2,FALSE)","v":false},{"$f":"IF(AND('First Process Date'!$F$8>='Pension Dates'!A9,'First Process Date'!$F$8<='Pension Dates'!B9),'First Process Date'!$C$8,FALSE)","v":false}]
["2014-12-28","2015-01-10","2014-12-27",{"$f":"IF(AND('First Process Date'!$F$2>='Pension Dates'!A10,'First Process Date'!$F$2<='Pension Dates'!B10),'First Process Date'!$C$2,FALSE)","v":false},{"$f":"IF(AND('First Process Date'!$F$8>='Pension Dates'!A10,'First Process Date'!$F$8<='Pension Dates'!B10),'First Process Date'!$C$8,FALSE)","v":false}]
["2015-01-11","2015-01-24","2015-01-10",{"$f":"IF(AND('First Process Date'!$F$2>='Pension Dates'!A11,'First Process Date'!$F$2<='Pension Dates'!B11),'First Process Date'!$C$2,FALSE)","v":false},{"$f":"IF(AND('First Process Date'!$F$8>='Pension Dates'!A11,'First Process Date'!$F$8<='Pension Dates'!B11),'First Process Date'!$C$8,FALSE)","v":false}]
["2015-01-25","2015-02-07","2015-01-24",{"$f":"IF(AND('First Process Date'!$F$2>='Pension Dates'!A12,'First Process Date'!$F$2<='Pension Dates'!B12),'First Process Date'!$C$2,FALSE)","v":false},{"$f":"IF(AND('First Process Date'!$F$8>='Pension Dates'!A12,'First Process Date'!$F$8<='Pension Dates'!B12),'First Process Date'!$C$8,FALSE)","v":false}]
["2015-02-08","2015-02-21","2015-02-07",{"$f":"IF(AND('First Process Date'!$F$2>='Pension Dates'!A13,'First Process Date'!$F$2<='Pension Dates'!B13),'First Process Date'!$C$2,FALSE)","v":false},{"$f":"IF(AND('First Process Date'!$F$8>='Pension Dates'!A13,'First Process Date'!$F$8<='Pension Dates'!B13),'First Process Date'!$C$8,FALSE)","v":false}]
["2015-02-22","2015-03-07","2015-02-21",{"$f":"IF(AND('First Process Date'!$F$2>='Pension Dates'!A14,'First Process Date'!$F$2<='Pension Dates'!B14),'First Process Date'!$C$2,FALSE)","v":false},{"$f":"IF(AND('First Process Date'!$F$8>='Pension Dates'!A14,'First Process Date'!$F$8<='Pension Dates'!B14),'First Process Date'!$C$8,FALSE)","v":false}]
["2015-03-08","2015-03-21","2015-03-07",{"$f":"IF(AND('First Process Date'!$F$2>='Pension Dates'!A15,'First Process Date'!$F$2<='Pension Dates'!B15),'First Process Date'!$C$2,FALSE)","v":false},{"$f":"IF(AND('First Process Date'!$F$8>='Pension Dates'!A15,'First Process Date'!$F$8<='Pension Dates'!B15),'First Process Date'!$C$8,FALSE)","v":false}]
["2015-03-22","2015-04-04","2015-03-21",{"$f":"IF(AND('First Process Date'!$F$2>='Pension Dates'!A16,'First Process Date'!$F$2<='Pension Dates'!B16),'First Process Date'!$C$2,FALSE)","v":false},{"$f":"IF(AND('First Process Date'!$F$8>='Pension Dates'!A16,'First Process Date'!$F$8<='Pension Dates'!B16),'First Process Date'!$C$8,FALSE)","v":false}]
["2015-04-05","2015-04-18","2015-04-04",{"$f":"IF(AND('First Process Date'!$F$2>='Pension Dates'!A17,'First Process Date'!$F$2<='Pension Dates'!B17),'First Process Date'!$C$2,FALSE)","v":false},{"$f":"IF(AND('First Process Date'!$F$8>='Pension Dates'!A17,'First Process Date'!$F$8<='Pension Dates'!B17),'First Process Date'!$C$8,FALSE)","v":false}]
["2015-04-19","2015-05-02","2015-04-18",{"$f":"IF(AND('First Process Date'!$F$2>='Pension Dates'!A18,'First Process Date'!$F$2<='Pension Dates'!B18),'First Process Date'!$C$2,FALSE)","v":false},{"$f":"IF(AND('First Process Date'!$F$8>='Pension Dates'!A18,'First Process Date'!$F$8<='Pension Dates'!B18),'First Process Date'!$C$8,FALSE)","v":false}]
["2015-05-03","2015-05-16","2015-05-02",{"$f":"IF(AND('First Process Date'!$F$2>='Pension Dates'!A19,'First Process Date'!$F$2<='Pension Dates'!B19),'First Process Date'!$C$2,FALSE)","v":false},{"$f":"IF(AND('First Process Date'!$F$8>='Pension Dates'!A19,'First Process Date'!$F$8<='Pension Dates'!B19),'First Process Date'!$C$8,FALSE)","v":false}]
["2015-05-17","2015-05-30","2015-05-16",{"$f":"IF(AND('First Process Date'!$F$2>='Pension Dates'!A20,'First Process Date'!$F$2<='Pension Dates'!B20),'First Process Date'!$C$2,FALSE)","v":false},{"$f":"IF(AND('First Process Date'!$F$8>='Pension Dates'!A20,'First Process Date'!$F$8<='Pension Dates'!B20),'First Process Date'!$C$8,FALSE)","v":false}]
{"$rows_left_out":669}
{"sheet":"First Process Date","index":6,"n_rows":10,"n_cols":6,"rows_kept":10,"cut":false,"hidden":false,"merged":[[9,0,10,1],[9,2,10,4],[1,0,2,1],[1,2,2,4],[3,0,4,1],[3,2,4,4],[7,0,8,1],[7,2,8,4]]}
[]
["NEW AWARD \nCREATION DATE",null,{"$f":"TODAY()","v":"2024-02-27"},null,null,{"$f":"C2","v":45349}]
[]
["FIRST PROCESS DATE",null,{"$f":"INDEX('Pension Dates'!$C$1:$C$748,MATCH($F$2,'Pension Dates'!$D$1:$D$748,0))","v":"2024-02-24"}]
[]
[]
[]
["ADJUSTED AWARD \nBEGIN DATE",null,null,null,null,{"$f":"C8","v":0}]
[]
["FIRST PROCESS DATE",null,{"$f":"INDEX('Pension Dates'!$C$1:$C$748,MATCH($F$8,'Pension Dates'!$E$1:$E$748,0))+14","v":{"$error":"#N/A"}}]

{"sheet":"Retirement Date","index":7,"n_rows":14,"n_cols":19,"rows_kept":14,"cut":false,"hidden":false,"merged":[[3,3,4,4],[3,0,4,1],[3,2,4,2],[3,5,4,7]]}
[]
[null,null,null,null,null,null,null,null,null,null,null,null,"1900-01-01","1937-12-31",{"$f":"IF(AND($C$6>=M2,$C$6<=N2),$C$6,FALSE)","v":false},65,23741,null,65]
[null,null,null,null,null,null,null,null,null,null,null,null,"1938-01-01",{"$f":"M4-1","v":"1938-12-31"},{"$f":"IF(AND($C$6>=M3,$C$6<=N3),$C$6,FALSE)","v":false},65.166666666666671,23803,null,"65 and 2 months"]
["Claimant DOB",null,null,"Full Retirement Date",null,{"$f":"CONCATENATE(E7,\"/\",\"01\",\"/\",F7)","v":{"$error":"#N/A"}},null,null,null,null,null,null,"1939-01-01",{"$f":"M5-1","v":"1939-12-31"},false,65.333333333333329,23861,null,"65 and 4 months"]
[null,null,null,null,null,null,null,null,null,null,null,null,"1940-01-01","1940-12-31",false,65.5,23921,null,"65 and 6 months"]
[null,null,{"$f":"C4","v":0},{"$f":"INDEX($Q$2:$Q$14,MATCH($C$6,$O$2:$O$14,0))","v":{"$error":"#N/A"}},{"$f":"C4+D6","v":{"$error":"#N/A"}},null,null,null,null,null,null,null,"1941-01-01","1941-12-31",false,65.666666666666671,23981,null,"65 and 8 months"]
[{"$f":"MONTH(C4)","v":1},null,{"$f":"YEAR(C4)","v":1900},null,{"$f":"MONTH(E6)","v":{"$error":"#N/A"}},{"$f":"YEAR(E6)","v":{"$error":"#N/A"}},null,null,null,null,null,null,"1942-01-01","1942-12-31",false,65.833333333333329,24041,null,"65 and 10 months"]
[null,null,null,null,null,null,null,null,null,null,null,null,"1943-01-01","1954-12-31",false,66,24106,null,66]
[null,null,null,null,null,null,null,null,null,null,null,null,"1955-01-01","1955-12-31",false,66.166666666666671,24168,null,"66 and 2 months"]
[null,null,null,null,null,null,null,null,null,null,null,null,"1956-01-01","1956-12-31",false,66.333333333333329,24226,null,"66 and 4 months"]
[null,null,null,null,null,null,null,null,null,null,null,null,"1957-01-01","1957-12-31",false,66.5,24286,null,"66 and 6 months"]
[null,null,null,null,null,null,null,null,null,null,null,null,"1958-01-01","1958-12-31",false,66.666666666666671,24346,null,"66 and 8 months"]
[null,null,null,null,null,null,null,null,null,null,null,null,"1959-01-01","1959-12-31",false,66.833333333333329,24406,null,"66 and 10 months"]
[null,null,null,null,null,null,null,null,null,null,null,null,"1960-01-01","2040-12-31",false,67,24471,null,67]

{"sheet":"LSA at 25%","index":8,"n_rows":9,"n_cols":2,"rows_kept":9,"cut":false,"hidden":false,"merged":[]}
[]
[]
[]
[]
["LSA Amount granted against PTD"]
[]
["Customer Overpayment Balance"]
[]
["Amount to enter in Claim Overpayment Recovery with LSA Indemnity Type",{"$f":"IF(B7>B5*0.25,B5*0.25,B7)","v":0}]

{"sheet":"PTD%PP Offset","index":9,"n_rows":17,"n_cols":9,"rows_kept":17,"cut":false,"hidden":false,"merged":[[0,4,1,4]]}
[null,null,null,null,"Calculated Daily Rate"]
[null,"From","Through","Wkly Rate",null,"# Days","Amount"]
["PTD Award Dates",null,null,null,{"$f":"D3/7","v":0},{"$f":"C3-B3+1","v":1},{"$f":"E3*F3","v":0}]
["Overlapping %PP Award",null,null,null,{"$f":"D4/7","v":0},{"$f":"C4-B4+1","v":1},{"$f":"E4*F4","v":0}]
[]
[]
[]
[]
[null,null,"Effective Date","Expiration Date",null,"Weekly Offset Amt Entry","Calculated Payment made to claimant"]
[null,"Full Rate Offset",{"$f":"B3","v":"00:00:00"},{"$f":"E10+C10","v":{"$error":"#DIV/0!"}},{"$f":"I10","v":{"$error":"#DIV/0!"}},{"$f":"D3","v":0},{"$f":"E10*E3","v":{"$error":"#DIV/0!"}},{"$f":"G4/E3","v":{"$error":"#DIV/0!"}},{"$f":"ROUNDDOWN(H10,0)","v":{"$error":"#DIV/0!"}}]
[null,"Partial Rate Offset",{"$f":"D10+1","v":{"$error":"#DIV/0!"}},{"$f":"C11","v":{"$error":"#DIV/0!"}},{"$f":"H10-I10","v":{"$error":"#DIV/0!"}},{"$f":"$D$3*(1-E11)","v":{"$error":"#DIV/0!"}},{"$f":"E11*E3","v":{"$error":"#DIV/0!"}}]
[null,null,null,"Total Recouped after offset entries",null,null,{"$f":"SUM(G10:G11)","v":{"$error":"#DIV/0!"}}]
[]
[null,null,null,null,null,"Difference",{"$f":"G4-G12","v":{"$error":"#DIV/0!"}}]
[]
[null,"Entries made in worksheet for new award and any previous awards applied toward this amount"]
[null,"Entries made in PowerSuite in Adjustment Screen as offset(s)"]